Target
Cannabinoid receptor 1
Ligand
BDBM50260681
Substrate
Meas. Tech.
ChEMBL_556341 (CHEMBL954074)
Ki
0.83±n/a nM
Citation
 Wustrow, DJMaynard, GDYuan, JZhao, HMao, JGuo, QKershaw, MHammer, JBrodbeck, RMNear, KEZhou, DBeers, DSChenard, BLKrause, JEHutchison, AJ Aminopyrazine CB1 receptor inverse agonists. Bioorg Med Chem Lett 18:3376-81 (2008)  
Target
Name:
Cannabinoid receptor 1
Synonyms:
Brain-type cannabinoid receptor CB-R CNR1_RAT Cannabinoid receptor Cnr1 | Skr6
Type:
G Protein-Coupled Receptor (GPCR)
Mol. Mass.:
52856.55
Organism:
Rattus norvegicus (rat)
Description:
P20272
Residue:
473
  
Inhibitor
Name:
BDBM50260681
Synonyms:
4-[6-(3-Chloro-pyridin-4-yl)-5-(4-trifluoromethyl-phenyl)-pyrazin-2-yl]-thiomorpholine 1,1-dioxide | CHEMBL496091
Type:
Small organic molecule
Emp. Form.:
C20H16ClF3N4O2S
Mol. Mass.:
468.88
SMILES:
FC(F)(F)c1ccc(cc1)-c1ncc(nc1-c1ccncc1Cl)N1CCS(=O)(=O)CC1
: