Target
Cannabinoid receptor 1
Ligand
BDBM50260804
Substrate
Meas. Tech.
ChEMBL_556337 (CHEMBL954070)
Ki
1.97±n/a nM
Citation
 Wustrow, DJMaynard, GDYuan, JZhao, HMao, JGuo, QKershaw, MHammer, JBrodbeck, RMNear, KEZhou, DBeers, DSChenard, BLKrause, JEHutchison, AJ Aminopyrazine CB1 receptor inverse agonists. Bioorg Med Chem Lett 18:3376-81 (2008)  
Target
Name:
Cannabinoid receptor 1
Synonyms:
CANN6 CB-R CNR CNR1_HUMAN Cannabinoid receptor Cannabinoid receptor 1 (brain)
Type:
G Protein-Coupled Receptor (GPCR)
Mol. Mass.:
52868.96
Organism:
Homo sapiens (Human)
Description:
P21554
Residue:
472
  
Inhibitor
Name:
BDBM50260804
Synonyms:
CHEMBL497556 | N-(1-(6-(3-chloropyridin-4-yl)-5-(4-(trifluoromethyl)phenyl)pyrazin-2-yl)piperidin-4-yl)acetamide
Type:
Small organic molecule
Emp. Form.:
C23H21ClF3N5O
Mol. Mass.:
475.894
SMILES:
CC(=O)NC1CCN(CC1)c1cnc(-c2ccc(cc2)C(F)(F)F)c(n1)-c1ccncc1Cl
: