Target
Cannabinoid receptor 1
Ligand
BDBM50260803
Substrate
Meas. Tech.
ChEMBL_556337 (CHEMBL954070)
Ki
1.2±n/a nM
Citation
 Wustrow, DJMaynard, GDYuan, JZhao, HMao, JGuo, QKershaw, MHammer, JBrodbeck, RMNear, KEZhou, DBeers, DSChenard, BLKrause, JEHutchison, AJ Aminopyrazine CB1 receptor inverse agonists. Bioorg Med Chem Lett 18:3376-81 (2008)  
Target
Name:
Cannabinoid receptor 1
Synonyms:
CANN6 CB-R CNR CNR1_HUMAN Cannabinoid receptor Cannabinoid receptor 1 (brain)
Type:
G Protein-Coupled Receptor (GPCR)
Mol. Mass.:
52868.96
Organism:
Homo sapiens (Human)
Description:
P21554
Residue:
472
  
Inhibitor
Name:
BDBM50260803
Synonyms:
1-(6-(2-chloropyridin-4-yl)-5-(4-(trifluoromethyl)phenyl)pyrazin-2-yl)-3-(ethylamino)azetidine-3-carboxamide | CHEMBL498783
Type:
Small organic molecule
Emp. Form.:
C22H20ClF3N6O
Mol. Mass.:
476.882
SMILES:
CCNC1(CN(C1)c1cnc(-c2ccc(cc2)C(F)(F)F)c(n1)-c1ccnc(Cl)c1)C(N)=O
: