Target
Cannabinoid receptor 1
Ligand
BDBM50260767
Substrate
Meas. Tech.
ChEMBL_556337 (CHEMBL954070)
Ki
0.67±n/a nM
Citation
 Wustrow, DJMaynard, GDYuan, JZhao, HMao, JGuo, QKershaw, MHammer, JBrodbeck, RMNear, KEZhou, DBeers, DSChenard, BLKrause, JEHutchison, AJ Aminopyrazine CB1 receptor inverse agonists. Bioorg Med Chem Lett 18:3376-81 (2008)  
Target
Name:
Cannabinoid receptor 1
Synonyms:
CANN6 CB-R CNR CNR1_HUMAN Cannabinoid receptor Cannabinoid receptor 1 (brain)
Type:
G Protein-Coupled Receptor (GPCR)
Mol. Mass.:
52868.96
Organism:
Homo sapiens (Human)
Description:
P21554
Residue:
472
  
Inhibitor
Name:
BDBM50260767
Synonyms:
1-(5-(4-chlorophenyl)-6-(2-chloropyridin-4-yl)pyrazin-2-yl)-4-(ethylamino)piperidine-4-carboxamide | CHEMBL496507
Type:
Small organic molecule
Emp. Form.:
C23H24Cl2N6O
Mol. Mass.:
471.382
SMILES:
CCNC1(CCN(CC1)c1cnc(-c2ccc(Cl)cc2)c(n1)-c1ccnc(Cl)c1)C(N)=O
: