Target
Sodium-dependent serotonin transporter
Ligand
BDBM50370475
Substrate
Meas. Tech.
ChEMBL_510092 (CHEMBL998746)
IC50
>10000±n/a nM
Citation
 Hudson, SKiankarimi, MEccles, WDwight, WMostofi, YSGenicot, MJFleck, BAGogas, KAparicio, AWang, HWen, JWade, WS Structure-activity relationships of chiral selective norepinephrine reuptake inhibitors (sNRI) with increased oxidative stability. Bioorg Med Chem Lett 18:4491-4 (2008)  
Target
Name:
Sodium-dependent serotonin transporter
Synonyms:
5-HT Transporter 5HTT SC6A4_HUMAN SLC6A4 Serotonin transporter (5HTT) Sodium-dependent serotonin transporter (SERT) | Solute carrier family 6 member 4
Type:
Multi-pass membrane protein
Mol. Mass.:
70322.51
Organism:
Homo sapiens (Human)
Description:
P31645
Residue:
630
  
Inhibitor
Name:
BDBM50370475
Synonyms:
S,S-REBOXETINE
Type:
Small organic molecule
Emp. Form.:
C19H23NO3
Mol. Mass.:
313.3908
SMILES:
CCOc1ccccc1O[C@H]([C@H]1CNCCO1)c1ccccc1
: