Target
Transporter
Ligand
BDBM50244044
Substrate
Meas. Tech.
ChEMBL_491868 (CHEMBL946205)
IC50
3100±n/a nM
Citation
 Zhang, MJovic, FVickers, TDyck, BTamiya, JGrey, JTran, JAFleck, BAPick, RFoster, ACChen, C Studies on the structure-activity relationship of bicifadine analogs as monoamine transporter inhibitors. Bioorg Med Chem Lett 18:3682-6 (2008)  
Target
Name:
Transporter
Synonyms:
NE transporter Norepinephrine transporter(NET)
Type:
Multi-pass membrane protein
Mol. Mass.:
69236.90
Organism:
Rattus norvegicus (rat)
Description:
Q63380
Residue:
617
  
Inhibitor
Name:
BDBM50244044
Synonyms:
1-(5-(trifluoromethyl)thiophen-2-yl)-3-aza-bicyclo[3.1.0]hexane | CHEMBL505742
Type:
Small organic molecule
Emp. Form.:
C10H10F3NS
Mol. Mass.:
233.253
SMILES:
FC(F)(F)c1ccc(s1)C12CC1CNC2
: