Target
ATP-binding cassette sub-family C member 9
Ligand
BDBM50247613
Substrate
Meas. Tech.
ChEMBL_495672 (CHEMBL1006149)
EC50
8440±n/a nM
Citation
 Zhang, XQiu, YLi, XBhattacharjee, SWoods, MKraft, PLundeen, SGSui, Z Discovery and structure-activity relationships of a novel series of benzopyran-based K(ATP) openers for urge urinary incontinence. Bioorg Med Chem 17:855-66 (2009)  
Target
Name:
ATP-binding cassette sub-family C member 9
Synonyms:
ABCC9 ATP-binding cassette transporter sub-family C member 9 Sulfonylurea receptor 2 | Sulfonylurea receptor 2, Kir6.2
Type:
PROTEIN
Mol. Mass.:
174236.59
Organism:
Homo sapiens (Human)
Description:
ChEMBL_495672
Residue:
1549
  
Inhibitor
Name:
BDBM50247613
Synonyms:
(3S,4R)-4-(5-Fluoro-benzothiazol-2-ylamino)-3-hydroxy-2,2-dimethyl-chroman-6-carbonitrile | CHEMBL490883
Type:
Small organic molecule
Emp. Form.:
C19H16FN3O2S
Mol. Mass.:
369.413
SMILES:
CC1(C)Oc2ccc(cc2[C@@H](Sc2nc3ccc(F)cc3[nH]2)[C@@H]1O)C#N
: