Target
Sodium-dependent noradrenaline transporter
Ligand
BDBM50366567
Substrate
Meas. Tech.
ChEMBL_500244 (CHEMBL966882)
IC50
3±n/a nM
Citation
 Vu, ATCohn, STTerefenko, EAMoore, WJZhang, PMahaney, PETrybulski, EJGoljer, IDooley, RBray, JAJohnston, GHLeiter, JDeecher, DC 3-(Arylamino)-3-phenylpropan-2-olamines as a new series of dual norepinephrine and serotonin reuptake inhibitors. Bioorg Med Chem Lett 19:2464-7 (2009)  
Target
Name:
Sodium-dependent noradrenaline transporter
Synonyms:
Monoamine transporter NET Noradrenaline Transporter (NET) Norepinephrine transporter protein (NET) SLC6A2 Sodium-dependent noradrenaline transporter (NET) | Solute carrier family 6 member 2
Type:
Multi-pass membrane protein
Mol. Mass.:
69337.72
Organism:
Homo sapiens (Human)
Description:
P23975
Residue:
617
  
Inhibitor
Name:
BDBM50366567
Synonyms:
ATOMOXETINE
Type:
Small organic molecule
Emp. Form.:
C17H21NO
Mol. Mass.:
255.3547
SMILES:
CNCC[C@@H](Oc1ccccc1C)c1ccccc1
: