Target
Sodium-dependent noradrenaline transporter
Ligand
BDBM50259340
Substrate
Meas. Tech.
ChEMBL_500244 (CHEMBL966882)
IC50
12±n/a nM
Citation
 Vu, ATCohn, STTerefenko, EAMoore, WJZhang, PMahaney, PETrybulski, EJGoljer, IDooley, RBray, JAJohnston, GHLeiter, JDeecher, DC 3-(Arylamino)-3-phenylpropan-2-olamines as a new series of dual norepinephrine and serotonin reuptake inhibitors. Bioorg Med Chem Lett 19:2464-7 (2009)  
Target
Name:
Sodium-dependent noradrenaline transporter
Synonyms:
Monoamine transporter NET Noradrenaline Transporter (NET) Norepinephrine transporter protein (NET) SLC6A2 Sodium-dependent noradrenaline transporter (NET) | Solute carrier family 6 member 2
Type:
Multi-pass membrane protein
Mol. Mass.:
69337.72
Organism:
Homo sapiens (Human)
Description:
P23975
Residue:
617
  
Inhibitor
Name:
BDBM50259340
Synonyms:
(1S,2R)-1-(3-fluorophenyl)-1-(methyl(phenyl)amino)-3-(methylamino)propan-2-ol CHEMBL467323
Type:
Small organic molecule
Emp. Form.:
C17H21FN2O
Mol. Mass.:
288.3598
SMILES:
CNC[C@@H](O)[C@@H](N(C)c1ccccc1)c1cccc(F)c1
: