Target
Sodium-dependent serotonin transporter
Ligand
BDBM50259231
Substrate
Meas. Tech.
ChEMBL_500246 (CHEMBL966884)
IC50
33±n/a nM
Citation
 Vu, ATCohn, STTerefenko, EAMoore, WJZhang, PMahaney, PETrybulski, EJGoljer, IDooley, RBray, JAJohnston, GHLeiter, JDeecher, DC 3-(Arylamino)-3-phenylpropan-2-olamines as a new series of dual norepinephrine and serotonin reuptake inhibitors. Bioorg Med Chem Lett 19:2464-7 (2009)  
Target
Name:
Sodium-dependent serotonin transporter
Synonyms:
5-HT Transporter 5HTT SC6A4_HUMAN SLC6A4 Serotonin transporter (5HTT) Sodium-dependent serotonin transporter (SERT) | Solute carrier family 6 member 4
Type:
Multi-pass membrane protein
Mol. Mass.:
70322.51
Organism:
Homo sapiens (Human)
Description:
P31645
Residue:
630
  
Inhibitor
Name:
BDBM50259231
Synonyms:
(R,S/S,R)-syn-1-((4-fluorophenyl)(methyl)amino)-3-(methylamino)-1-phenylpropan-2-ol | CHEMBL466293
Type:
Small organic molecule
Emp. Form.:
C17H21FN2O
Mol. Mass.:
288.3598
SMILES:
CNC[C@@H](O)[C@@H](N(C)c1ccc(F)cc1)c1ccccc1
: