Target
Sodium-dependent noradrenaline transporter
Ligand
BDBM50370475
Substrate
Meas. Tech.
ChEMBL_583225 (CHEMBL1055024)
IC50
3.1±n/a nM
Citation
 Zhang, PTerefenko, EABray, JDeecher, DFensome, AHarrison, JKim, CKoury, EMark, LMcComas, CCMugford, CATrybulski, EJVu, ATWhiteside, GTMahaney, PE 1- or 3-(3-Amino-2-hydroxy-1-phenyl propyl)-1,3-dihydro-2H-benzimidazol-2-ones: potent, selective, and orally efficacious norepinephrine reuptake inhibitors. J Med Chem 52:5703-11 (2009)  
Target
Name:
Sodium-dependent noradrenaline transporter
Synonyms:
Monoamine transporter NET Noradrenaline Transporter (NET) Norepinephrine transporter protein (NET) SLC6A2 Sodium-dependent noradrenaline transporter (NET) | Solute carrier family 6 member 2
Type:
Multi-pass membrane protein
Mol. Mass.:
69337.72
Organism:
Homo sapiens (Human)
Description:
P23975
Residue:
617
  
Inhibitor
Name:
BDBM50370475
Synonyms:
S,S-REBOXETINE
Type:
Small organic molecule
Emp. Form.:
C19H23NO3
Mol. Mass.:
313.3908
SMILES:
CCOc1ccccc1O[C@H]([C@H]1CNCCO1)c1ccccc1
: