Target
Melanocyte-stimulating hormone receptor
Ligand
BDBM50301155
Substrate
Meas. Tech.
ChEMBL_598567 (CHEMBL1043559)
EC50
0.01±n/a nM
Citation
 Ruwe, ARKoikov, LAbdel-Malek, ZHaskell-Luevano, CDirain, MLPortillo, FXiang, ZWortman, MKnittel, JJ Semi-rigid tripeptide agonists of melanocortin receptors. Bioorg Med Chem Lett 19:5176-81 (2009)  
Target
Name:
Melanocyte-stimulating hormone receptor
Synonyms:
MC1-R MSH-R MSHR_HUMAN Melanocortin receptor (M1 and M4) Melanocortin receptor 1 (MC1-R) | Melanocortin receptor 1 (MC1R)
Type:
Enzyme
Mol. Mass.:
34717.23
Organism:
Homo sapiens (Human)
Description:
Q01726
Residue:
317
  
Inhibitor
Name:
BDBM50301155
Synonyms:
CHEMBL569693 | Ph(CH2)3CO-His-D-Phe-Arg-Trp-NH2
Type:
Small organic molecule
Emp. Form.:
C43H52N10O5
Mol. Mass.:
788.937
SMILES:
NC(N)=NCCC[C@H](NC(=O)[C@@H](Cc1ccccc1)NC(=O)[C@H](Cc1cc[nH]c1)NC(=O)CCCc1ccccc1)C(=O)N[C@H](Cc1c[nH]c2ccccc12)C(N)=O
: