Target
Cytochrome P450 3A4
Ligand
BDBM50314264
Substrate
Meas. Tech.
ChEMBL_624295 (CHEMBL1106980)
IC50
>10000±n/a nM
Citation
 Moree, WJJovic, FCoon, TYu, JLi, BFTucci, FCMarinkovic, DGross, RSMalany, SBradbury, MJHernandez, LMO'Brien, ZWen, JWang, HHoare, SRPetroski, RESacaan, AMadan, ACrowe, PDBeaton, G Novel benzothiophene H1-antihistamines for the treatment of insomnia. Bioorg Med Chem Lett 20:2316-20 (2010)  
Target
Name:
Cytochrome P450 3A4
Synonyms:
Albendazole monooxygenase CP3A4_HUMAN CYP3A4 CYPIIIA4 Cytochrome P450 3A4 (CYP3A4) Nifedipine oxidase Taurochenodeoxycholate 6-alpha-hydroxylase
Type:
Enzyme
Mol. Mass.:
57349.57
Organism:
Homo sapiens (Human)
Description:
Residue:
503
  
Inhibitor
Name:
BDBM50314264
Synonyms:
(-)-(R)-2-(1-(2-(2-(azetidin-1-yl)ethyl)benzo[b]thiophen-3-yl)ethyl)pyridine | CHEMBL1091775
Type:
Small organic molecule
Emp. Form.:
C20H22N2S
Mol. Mass.:
322.467
SMILES:
C[C@H](c1c(CCN2CCC2)sc2ccccc12)c1ccccn1
: