Target
Translocator protein
Ligand
BDBM22032
Substrate
Meas. Tech.
ChEMBL_664273 (CHEMBL1259308)
Ki
9.3±n/a nM
Citation
 Reynolds, AHanani, RHibbs, DDamont, ADa Pozzo, ESelleri, SDollé, FMartini, CKassiou, M Pyrazolo[1,5-a]pyrimidine acetamides: 4-Phenyl alkyl ether derivatives as potent ligands for the 18 kDa translocator protein (TSPO). Bioorg Med Chem Lett 20:5799-802 (2010)  
Target
Name:
Translocator protein
Synonyms:
Benzodiazepine receptors; peripheral & central Mbr PBR Peripheral benzodiazepine receptor (PBR) TSPO_RAT | Tspo
Type:
Mitochondrion membrane protein
Mol. Mass.:
18945.84
Organism:
Rattus norvegicus (rat)
Description:
Competitive binding experiments were performed on rat kidney mitochondrial membranes.
Residue:
169
  
Inhibitor
Name:
BDBM22032
Synonyms:
1-(2-chlorophenyl)-N-methyl-N-(1-methylpropyl)isoquinoline-3-carboxamide N-(butan-2-yl)-1-(2-chlorophenyl)-N-methylisoquinoline-3-carboxamide PK-11195 RP 52028 | [3H]PK 11195
Type:
radiolabeled ligand
Emp. Form.:
C21H21ClN2O
Mol. Mass.:
352.857
SMILES:
CCC(C)N(C)C(=O)c1cc2ccccc2c(n1)-c1ccccc1Cl
: