Target
Maltase-glucoamylase
Ligand
BDBM50330960
Substrate
Meas. Tech.
ChEMBL_684093 (CHEMBL1286470)
Ki
60±n/a nM
Citation
 Mohan, SSim, LRose, DRPinto, BM Probing the active-site requirements of human intestinal N-terminal maltase-glucoamylase: Synthesis and enzyme inhibitory activities of a six-membered ring nitrogen analogue of kotalanol and its de-O-sulfonated derivative. Bioorg Med Chem 18:7794-8 (2010)  
Target
Name:
Maltase-glucoamylase
Synonyms:
Alpha glucosidase Glucan 1,4-alpha-glucosidase MGAM MGA_HUMAN Maltase-glucoamylase, intestinal | Synonyms=MGA
Type:
Enzyme
Mol. Mass.:
209817.06
Organism:
Homo sapiens (Human)
Description:
O43451
Residue:
2753
  
Inhibitor
Name:
BDBM50330960
Synonyms:
(2R,3R,4R)-1-((2R,3R,4S,5R,6S)-2,3,4,5,6,7-hexahydroxyheptyl)-3,4-dihydroxy-2-(hydroxymethyl)pyrrolidinium chloride | CHEMBL1277240
Type:
Small organic molecule
Emp. Form.:
C12H25NO9
Mol. Mass.:
327.3282
SMILES:
OC[C@H](O)[C@@H](O)[C@@H](O)[C@H](O)[C@H](O)CN1C[C@@H](O)[C@H](O)[C@H]1CO
: