Target
11-beta-hydroxysteroid dehydrogenase 1
Ligand
BDBM50335198
Substrate
Meas. Tech.
ChEMBL_701686 (CHEMBL1656578)
IC50
1135±n/a nM
Citation
 Starcevic, SBrozic, PTurk, SCesar, JRizner, TLGobec, S Synthesis and biological evaluation of (6- and 7-phenyl) coumarin derivatives as selective nonsteroidal inhibitors of 17ß-hydroxysteroid dehydrogenase type 1. J Med Chem 54:248-61 (2011)  
Target
Name:
11-beta-hydroxysteroid dehydrogenase 1
Synonyms:
11-DH 11-beta-Hydroxysteroid Dehydrogenase 1 (11-beta-HSD1) 11-beta-hydroxysteroid dehydrogenase 1 (11HSD1) Corticosteroid 11-beta-dehydrogenase isozyme 1 (11-beta-HSD-1) Corticosteroid 11-beta-dehydrogenase isozyme 1 (11beta-HSD1) HSD11 HSD11L | SDR26C1
Type:
Enzyme
Mol. Mass.:
32409.16
Organism:
Homo sapiens (Human)
Description:
P28845
Residue:
292
  
Inhibitor
Name:
BDBM50335198
Synonyms:
3-Acetyl-7-(4-methoxyphenyl)-2H-chromen-2-one | CHEMBL1650701
Type:
Small organic molecule
Emp. Form.:
C18H14O4
Mol. Mass.:
294.3014
SMILES:
COc1ccc(cc1)-c1ccc2cc(C(C)=O)c(=O)oc2c1
: