Target
11-beta-hydroxysteroid dehydrogenase 1
Ligand
BDBM50335195
Substrate
Meas. Tech.
ChEMBL_701687 (CHEMBL1656579)
Ki
173±n/a nM
Citation
 Starcevic, SBrozic, PTurk, SCesar, JRizner, TLGobec, S Synthesis and biological evaluation of (6- and 7-phenyl) coumarin derivatives as selective nonsteroidal inhibitors of 17ß-hydroxysteroid dehydrogenase type 1. J Med Chem 54:248-61 (2011)  
Target
Name:
11-beta-hydroxysteroid dehydrogenase 1
Synonyms:
11-DH 11-beta-Hydroxysteroid Dehydrogenase 1 (11-beta-HSD1) 11-beta-hydroxysteroid dehydrogenase 1 (11HSD1) Corticosteroid 11-beta-dehydrogenase isozyme 1 (11-beta-HSD-1) Corticosteroid 11-beta-dehydrogenase isozyme 1 (11beta-HSD1) HSD11 HSD11L | SDR26C1
Type:
Enzyme
Mol. Mass.:
32409.16
Organism:
Homo sapiens (Human)
Description:
P28845
Residue:
292
  
Inhibitor
Name:
BDBM50335195
Synonyms:
3-Acetyl-2-oxo-2H-chromen-7-yl trifluoromethanesulfonate | CHEMBL1650554
Type:
Small organic molecule
Emp. Form.:
C12H7F3O6S
Mol. Mass.:
336.241
SMILES:
CC(=O)c1cc2ccc(OS(=O)(=O)C(F)(F)F)cc2oc1=O
: