Target
Nucleotide-binding oligomerization domain-containing protein 2
Ligand
BDBM62249
Substrate
Meas. Tech.
ChEMBL_812916 (CHEMBL2020291)
IC50
600±n/a nM
Citation
 Khan, PMCorrea, RGDivlianska, DBPeddibhotla, SSessions, EHMagnuson, GBrown, BSuyama, EYuan, HMangravita-Novo, AVicchiarelli, MSu, YVasile, SSmith, LHDiaz, PWReed, JCRoth, GP Identification of Inhibitors of NOD1-Induced Nuclear Factor-żB Activation. ACS Med Chem Lett 2:780-785 (2011)  
Target
Name:
Nucleotide-binding oligomerization domain-containing protein 2
Synonyms:
CARD15 IBD1 NOD2 Nucleotide-binding oligomerization domain-containing protein 2 | nucleotide-binding oligomerization domain containing 2
Type:
PROTEIN
Mol. Mass.:
115287.18
Organism:
Homo sapiens (Human)
Description:
ChEMBL_1454053
Residue:
1040
  
Inhibitor
Name:
BDBM62249
Synonyms:
1-[5-[4-(4-chlorophenyl)piperazin-1-yl]sulfonyl-2-methyl-2,3-dihydroindol-1-yl]propan-1-one 1-[5-[[4-(4-chlorophenyl)-1-piperazinyl]sulfonyl]-2-methyl-2,3-dihydroindol-1-yl]-1-propanone cid_44182143
Type:
Small organic molecule
Emp. Form.:
C22H26ClN3O3S
Mol. Mass.:
447.978
SMILES:
CCC(=O)N1C(C)Cc2cc(ccc12)S(=O)(=O)N1CCN(CC1)c1ccc(Cl)cc1
: