Target
C-C chemokine receptor type 2
Ligand
BDBM50382941
Substrate
Meas. Tech.
ChEMBL_819955 (CHEMBL2032542)
IC50
3.4±n/a nM
Citation
 Xue, CBWang, AHan, QZhang, YCao, GFeng, HHuang, TZheng, CXia, MZhang, KKong, LGlenn, JAnand, RMeloni, DRobinson, DJShao, LStorace, LLi, MHughes, RODevraj, RMorton, PARogier, DJCovington, MScherle, PDiamond, SEmm, TYeleswaram, SContel, NVaddi, KNewton, RHollis, GMetcalf, B Discovery of INCB8761/PF-4136309, a Potent, Selective, and Orally Bioavailable CCR2 Antagonist. ACS Med Chem Lett 2:913-918 (2011)  
Target
Name:
C-C chemokine receptor type 2
Synonyms:
C-C chemokine receptor type 2 (CCR2) CCR2_HUMAN Chemoattractant Cytokine Receptor 2 (CCR2) Monocyte chemotactic protein-1 (MCP-1)
Type:
Enzyme
Mol. Mass.:
41932.32
Organism:
Homo sapiens (Human)
Description:
P41597
Residue:
374
  
Inhibitor
Name:
BDBM50382941
Synonyms:
CHEMBL2029424
Type:
Small organic molecule
Emp. Form.:
C28H30F3N5O4
Mol. Mass.:
557.5641
SMILES:
O[C@]1(CC[C@@H](CC1)N[C@H]1CCN(C1)C(=O)CNC(=O)c1cccc(c1)C(F)(F)F)c1ccc(cn1)-c1ncco1
: