Target
Vascular endothelial growth factor receptor 2
Ligand
BDBM50383181
Substrate
Meas. Tech.
ChEMBL_819185 (CHEMBL2032454)
Ki
541±n/a nM
Citation
 Liu, LNorman, MHLee, MXi, NSiegmund, ABoezio, AABooker, SChoquette, DD'Angelo, NDGermain, JYang, KYang, YZhang, YBellon, SFWhittington, DAHarmange, JCDominguez, CKim, TSDussault, I Structure-based design of novel class II c-Met inhibitors: 2. SAR and kinase selectivity profiles of the pyrazolone series. J Med Chem 55:1868-97 (2012)  
Target
Name:
Vascular endothelial growth factor receptor 2
Synonyms:
CD_antigen=CD309 Fetal liver kinase 1 (FLK-1) KDR Protein-tyrosine kinase receptor Flk-1 VEGFR-2 VEGFR2 Vascular Endothelial Growth Factor Receptor Kinase 2 Vascular endothelial growth factor receptor 2 (KDR) Vascular endothelial growth factor receptor 2 (VEGFR2) Vascular endothelial growth factor receptor-2 (VEGFR-2)
Type:
Receptor Tyrosine Kinase
Mol. Mass.:
151510.97
Organism:
Homo sapiens (Human)
Description:
P35968
Residue:
1356
  
Inhibitor
Name:
BDBM50383181
Synonyms:
CHEMBL2031903
Type:
Small organic molecule
Emp. Form.:
C28H24FN5O4
Mol. Mass.:
513.5197
SMILES:
COc1ccc2c(Oc3ccc(NC(=O)c4c(CN)n(C)n(-c5ccccc5)c4=O)cc3F)ccnc2c1
: