Target
Hepatocyte growth factor receptor
Ligand
BDBM50384024
Substrate
Meas. Tech.
ChEMBL_819757 (CHEMBL2034187)
IC50
0.2±n/a nM
Citation
 Lee, JHan, SYJung, HYang, JChoi, JWChae, CHPark, CHChoi, SULee, KHa, JDLee, CORyu, JWKim, HRKoh, JSCho, SY Synthesis and structure-activity relationship of aminopyridines with substituted benzoxazoles as c-Met kinase inhibitors. Bioorg Med Chem Lett 22:4044-8 (2012)  
Target
Name:
Hepatocyte growth factor receptor
Synonyms:
Hepatocyte growth factor receptor Hepatocyte growth factor receptor (c-MET) MET Met proto-oncogene (hepatocyte growth factor receptor) Tyrosine-protein kinase Met (c-Met) c-Met kinase
Type:
Protein
Mol. Mass.:
155559.73
Organism:
Homo sapiens (Human)
Description:
P08581
Residue:
1390
  
Inhibitor
Name:
BDBM50384024
Synonyms:
CHEMBL2032280 | CHEMBL2079349
Type:
Small organic molecule
Emp. Form.:
C21H22N6O2
Mol. Mass.:
390.4384
SMILES:
Cc1c(O)ccc2nc(oc12)-c1cc(cnc1N)-c1cnn(c1)C1CCNCC1
: