Target
Hematopoietic prostaglandin D synthase
Ligand
BDBM50385148
Substrate
Meas. Tech.
ChEMBL_823085 (CHEMBL2039156)
IC50
6900±n/a nM
Citation
 Trujillo, JIKiefer, JRHuang, WDay, JEMoon, JJerome, GMBono, CPKornmeier, CMWilliams, MLKuhn, CRennie, GRWynn, TACarron, CPThorarensen, A Investigation of the binding pocket of human hematopoietic prostaglandin (PG) D2 synthase (hH-PGDS): a tale of two waters. Bioorg Med Chem Lett 22:3795-9 (2012)  
Target
Name:
Hematopoietic prostaglandin D synthase
Synonyms:
GSTS Glutathione-requiring prostaglandin D synthase HPGDS Hematopoietic prostaglandin D synthase Hematopoietic prostaglandin D synthase (HPGDS) PTGDS2 Prostaglandin D Synthase
Type:
Enzyme
Mol. Mass.:
23341.07
Organism:
Homo sapiens (Human)
Description:
The protein was expressed in E. coli strain BL21(DE3) with an N-terminal 6-His tag.
Residue:
199
  
Inhibitor
Name:
BDBM50385148
Synonyms:
CHEMBL2035648
Type:
Small organic molecule
Emp. Form.:
C16H19N3O2
Mol. Mass.:
285.341
SMILES:
COc1ccccc1N1CCN(CC1)C(=O)c1ccc[nH]1
: