Target
Glucose-dependent insulinotropic receptor
Ligand
BDBM50387900
Substrate
Meas. Tech.
ChEMBL_830702 (CHEMBL2061689)
EC50
550±n/a nM
Citation
 Sakairi, MKogami, MTorii, MKataoka, HFujieda, HMakino, MKataoka, DOkamoto, RMiyazawa, TOkabe, MInoue, MTakahashi, NHarada, SWatanabe, N Synthesis and SAR studies of bicyclic amine series GPR119 agonists. Bioorg Med Chem Lett 22:5123-8 (2012)  
Target
Name:
Glucose-dependent insulinotropic receptor
Synonyms:
G-protein coupled receptor 119 (GPR119) GPR119 | Glucose-dependent insulinotropic receptor
Type:
Protein
Mol. Mass.:
36901.49
Organism:
Homo sapiens (Human)
Description:
Q8TDV5
Residue:
335
  
Inhibitor
Name:
BDBM50387900
Synonyms:
CHEMBL2058401
Type:
Small organic molecule
Emp. Form.:
C21H31N3O3
Mol. Mass.:
373.4891
SMILES:
CC(C)(C)OC(=O)N1CCC(CCCNc2ccc3C(=O)NCc3c2)CC1
: