Target
Glucose-dependent insulinotropic receptor
Ligand
BDBM50387901
Substrate
Meas. Tech.
ChEMBL_830702 (CHEMBL2061689)
EC50
1029±n/a nM
Citation
 Sakairi, MKogami, MTorii, MKataoka, HFujieda, HMakino, MKataoka, DOkamoto, RMiyazawa, TOkabe, MInoue, MTakahashi, NHarada, SWatanabe, N Synthesis and SAR studies of bicyclic amine series GPR119 agonists. Bioorg Med Chem Lett 22:5123-8 (2012)  
Target
Name:
Glucose-dependent insulinotropic receptor
Synonyms:
G-protein coupled receptor 119 (GPR119) GPR119 | Glucose-dependent insulinotropic receptor
Type:
Protein
Mol. Mass.:
36901.49
Organism:
Homo sapiens (Human)
Description:
Q8TDV5
Residue:
335
  
Inhibitor
Name:
BDBM50387901
Synonyms:
CHEMBL2058402
Type:
Small organic molecule
Emp. Form.:
C21H32N2O4S
Mol. Mass.:
408.555
SMILES:
CC(C)(C)OC(=O)N1CCC(CCCNc2ccc3CCS(=O)(=O)c3c2)CC1
: