Target
Glucose-dependent insulinotropic receptor
Ligand
BDBM50387904
Substrate
Meas. Tech.
ChEMBL_830706 (CHEMBL2061693)
EC50
351±n/a nM
Citation
 Sakairi, MKogami, MTorii, MKataoka, HFujieda, HMakino, MKataoka, DOkamoto, RMiyazawa, TOkabe, MInoue, MTakahashi, NHarada, SWatanabe, N Synthesis and SAR studies of bicyclic amine series GPR119 agonists. Bioorg Med Chem Lett 22:5123-8 (2012)  
Target
Name:
Glucose-dependent insulinotropic receptor
Synonyms:
GP119_MOUSE | Gpr119
Type:
PROTEIN
Mol. Mass.:
37009.07
Organism:
Mus musculus
Description:
ChEMBL_1506420
Residue:
335
  
Inhibitor
Name:
BDBM50387904
Synonyms:
CHEMBL2058405
Type:
Small organic molecule
Emp. Form.:
C22H32N2O4
Mol. Mass.:
388.5005
SMILES:
CC(C)(C)OC(=O)N1CCC(CCCNc2ccc3OCCC(=O)c3c2)CC1
: