Target
Cathepsin K
Ligand
BDBM50390400
Substrate
Meas. Tech.
ChEMBL_834955 (CHEMBL2073365)
IC50
50.12±n/a nM
Citation
 Dossetter, AGBowyer, JCook, CRCrawford, JJFinlayson, JEHeron, NMHeyes, CHighton, AJHudson, JAJestel, AKrapp, SMacFaul, PAMcGuire, TMMorley, ADMorris, JJPage, KMRibeiro, LRSawney, HSteinbacher, SSmith, C Isosteric replacements for benzothiazoles and optimisation to potent Cathepsin K inhibitors free from hERG channel inhibition. Bioorg Med Chem Lett 22:5563-8 (2012)  
Target
Name:
Cathepsin K
Synonyms:
CATK_HUMAN CTSO Cathepsin O Cathepsin X
Type:
Enzyme
Mol. Mass.:
36975.68
Organism:
Homo sapiens (Human)
Description:
P43235
Residue:
329
  
Inhibitor
Name:
BDBM50390400
Synonyms:
CHEMBL2071095
Type:
Small organic molecule
Emp. Form.:
C22H26N6O2S
Mol. Mass.:
438.546
SMILES:
O=C(NC1(CC1)C#N)[C@@H]1CCCC[C@H]1C(=O)N1CCN(CC1)c1nc2ncccc2s1
: