Target
Protein kinase C eta type
Ligand
BDBM50391386
Substrate
Meas. Tech.
ChEMBL_848578 (CHEMBL2148242)
Ki
0.110000±n/a nM
Citation
 Kikumori, MYanagita, RCTokuda, HSuzuki, NNagai, HSuenaga, KIrie, K Structure-activity studies on the spiroketal moiety of a simplified analogue of debromoaplysiatoxin with antiproliferative activity. J Med Chem 55:5614-26 (2012)  
Target
Name:
Protein kinase C eta type
Synonyms:
KPCL_HUMAN PKCL PRKCL Protein kinase C, PKC; classical/novel | nPKC-eta
Type:
Enzyme
Mol. Mass.:
77844.26
Organism:
Homo sapiens (Human)
Description:
The recombinant human PKC enzymes were produced using a baculovirus expression system in SF9 cells
Residue:
683
  
Inhibitor
Name:
BDBM50391386
Synonyms:
CHEMBL2148106
Type:
Small organic molecule
Emp. Form.:
C32H48O10
Mol. Mass.:
592.7175
SMILES:
CO[C@@H](CC[C@H](C)[C@H]1O[C@@]23C[C@H](OC(=O)C[C@@H](OC(=O)C[C@](O)(O2)[C@H](C)CC3(C)C)[C@@H](C)O)[C@@H]1C)c1cccc(O)c1
: