Target
Protein kinase C eta type
Ligand
BDBM50391388
Substrate
Meas. Tech.
ChEMBL_848578 (CHEMBL2148242)
Ki
0.450000±n/a nM
Citation
 Kikumori, MYanagita, RCTokuda, HSuzuki, NNagai, HSuenaga, KIrie, K Structure-activity studies on the spiroketal moiety of a simplified analogue of debromoaplysiatoxin with antiproliferative activity. J Med Chem 55:5614-26 (2012)  
Target
Name:
Protein kinase C eta type
Synonyms:
KPCL_HUMAN PKCL PRKCL Protein kinase C, PKC; classical/novel | nPKC-eta
Type:
Enzyme
Mol. Mass.:
77844.26
Organism:
Homo sapiens (Human)
Description:
The recombinant human PKC enzymes were produced using a baculovirus expression system in SF9 cells
Residue:
683
  
Inhibitor
Name:
BDBM50391388
Synonyms:
CHEMBL2148108
Type:
Small organic molecule
Emp. Form.:
C28H40O8
Mol. Mass.:
504.6124
SMILES:
C[C@@H]1[C@@H](CCCCc2cccc(O)c2)O[C@]23C[C@@H]1OC(=O)C[C@H](CO)OC(=O)C[C@@H](CCC2(C)C)O3
: