Target
Aurora kinase B
Ligand
BDBM50394791
Substrate
Meas. Tech.
ChEMBL_859401 (CHEMBL2167307)
IC50
45±n/a nM
Citation
 Liu, GAbraham, STran, LVickers, TDXu, SHadd, MJQuiambao, SHolladay, MWHua, HFord Pulido, JMGunawardane, RNDavis, MIEichelberger, SRApuy, JLGitnick, DGardner, MFJames, JBreider, MABelli, BArmstrong, RCTreiber, DK Discovery of highly potent and selective pan-Aurora kinase inhibitors with enhanced in vivo antitumor therapeutic index. J Med Chem 55:3250-60 (2012)  
Target
Name:
Aurora kinase B
Synonyms:
AIK2 AIM1 ARK2 AURKB_HUMAN Aurora B-INCENP Aurora kinase B (AURKB) STK-1 STK12 Serine/threonine-protein kinase aurora B
Type:
Protein
Mol. Mass.:
39327.72
Organism:
Homo sapiens (Human)
Description:
Q96GD4
Residue:
344
  
Inhibitor
Name:
BDBM50394791
Synonyms:
CHEMBL2163397
Type:
Small organic molecule
Emp. Form.:
C27H32N8O2S
Mol. Mass.:
532.66
SMILES:
Cc1cc(Nc2nc(Sc3ccc(NC(=O)CN4CCC(C4)C(=O)C(C)(C)C)cc3)nn3cccc23)n[nH]1
: