Target
Aurora kinase B
Ligand
BDBM50394790
Substrate
Meas. Tech.
ChEMBL_859401 (CHEMBL2167307)
IC50
95±n/a nM
Citation
 Liu, GAbraham, STran, LVickers, TDXu, SHadd, MJQuiambao, SHolladay, MWHua, HFord Pulido, JMGunawardane, RNDavis, MIEichelberger, SRApuy, JLGitnick, DGardner, MFJames, JBreider, MABelli, BArmstrong, RCTreiber, DK Discovery of highly potent and selective pan-Aurora kinase inhibitors with enhanced in vivo antitumor therapeutic index. J Med Chem 55:3250-60 (2012)  
Target
Name:
Aurora kinase B
Synonyms:
AIK2 AIM1 ARK2 AURKB_HUMAN Aurora B-INCENP Aurora kinase B (AURKB) STK-1 STK12 Serine/threonine-protein kinase aurora B
Type:
Protein
Mol. Mass.:
39327.72
Organism:
Homo sapiens (Human)
Description:
Q96GD4
Residue:
344
  
Inhibitor
Name:
BDBM50394790
Synonyms:
CHEMBL2163399
Type:
Small organic molecule
Emp. Form.:
C26H32N8OS2
Mol. Mass.:
536.715
SMILES:
Cc1cc(Nc2nc(Sc3ccc(NC(=O)CN4CC[C@H](C4)SC(C)(C)C)cc3)nn3cccc23)n[nH]1
: