Target
Platelet glycoprotein 4
Ligand
BDBM50395009
Substrate
Meas. Tech.
ChEMBL_858884 (CHEMBL2167930)
IC50
1110±n/a nM
Citation
 Proulx, CPicard, ÉBoeglin, DPohankova, PChemtob, SOng, HLubell, WD Azapeptide analogues of the growth hormone releasing peptide 6 as cluster of differentiation 36 receptor ligands with reduced affinity for the growth hormone secretagogue receptor 1a. J Med Chem 55:6502-11 (2012)  
Target
Name:
Platelet glycoprotein 4
Synonyms:
Adipocyte membrane protein CD_antigen=CD36 Fat Fatty acid transport protein GPIV PAS IV Platelet glycoprotein IV
Type:
PROTEIN
Mol. Mass.:
52740.95
Organism:
Rattus norvegicus
Description:
ChEMBL_858884
Residue:
472
  
Inhibitor
Name:
BDBM50395009
Synonyms:
CHEMBL2163470
Type:
Small organic molecule
Emp. Form.:
C57H70N12O7
Mol. Mass.:
1035.2419
SMILES:
Cc1[nH]c2ccccc2c1C[C@@H](NC(=O)[C@@H]1Cc2cccc3CC[C@H](N)C(=O)N1c23)C(=O)N[C@H](CCCCN)C(=O)N[C@@H](Cc1c[nH]c2ccccc12)C(=O)N[C@H](Cc1ccccc1)C(=O)N[C@@H](CCCCN)C(N)=O
: