Target
Cathepsin K
Ligand
BDBM50390402
Substrate
Meas. Tech.
ChEMBL_864178 (CHEMBL2175127)
IC50
30±n/a nM
Citation
 Crawford, JJKenny, PWBowyer, JCook, CRFinlayson, JEHeyes, CHighton, AJHudson, JAJestel, AKrapp, SMartin, SMacfaul, PAMcDermott, BPMcGuire, TMMorley, ADMorris, JJPage, KMRibeiro, LRSawney, HSteinbacher, SSmith, CDossetter, AG Pharmacokinetic benefits of 3,4-dimethoxy substitution of a phenyl ring and design of isosteres yielding orally available cathepsin K inhibitors. J Med Chem 55:8827-37 (2012)  
Target
Name:
Cathepsin K
Synonyms:
CATK_HUMAN CTSO Cathepsin O Cathepsin X
Type:
Enzyme
Mol. Mass.:
36975.68
Organism:
Homo sapiens (Human)
Description:
P43235
Residue:
329
  
Inhibitor
Name:
BDBM50390402
Synonyms:
CHEMBL2071097
Type:
Small organic molecule
Emp. Form.:
C22H29N5O3S
Mol. Mass.:
443.562
SMILES:
O=C(NC1(CC1)C#N)[C@@H]1CCCC[C@H]1C(=O)N1CCN(CC1)c1nc2CCOCc2s1
: