Target
RAC-alpha serine/threonine-protein kinase
Ligand
BDBM50397793
Substrate
Meas. Tech.
ChEMBL_874580 (CHEMBL2186216)
IC50
>10000±n/a nM
Citation
 Ashwell, MALapierre, JMBrassard, CBresciano, KBull, CCornell-Kennon, SEathiraj, SFrance, DSHall, THill, JKelleher, EKhanapurkar, SKizer, DKoerner, SLink, JLiu, YMakhija, SMoussa, MNamdev, NNguyen, KNicewonger, RPalma, RSzwaya, JTandon, MUppalapati, UVensel, DVolak, LPVolckova, EWestlund, NWu, HYang, RYChan, TC Discovery and optimization of a series of 3-(3-phenyl-3H-imidazo[4,5-b]pyridin-2-yl)pyridin-2-amines: orally bioavailable, selective, and potent ATP-independent Akt inhibitors. J Med Chem 55:5291-310 (2012)  
Target
Name:
RAC-alpha serine/threonine-protein kinase
Synonyms:
AKT phosphorylation (p-AKT) AKT1/PPP1CA C-AKT PKB alpha Protein kinase B Protein kinase B (Akt 1) Protein kinase B alpha Proto-oncogene Akt (Akt1) Proto-oncogene c-Akt (AKT1) RAC-PK-alpha RAC-alpha serine/threonine-protein kinase (AKT1) | RAC-alpha serine/threonine-protein kinase (pAKT)
Type:
Enzyme
Mol. Mass.:
55681.25
Organism:
Homo sapiens (Human)
Description:
P31749
Residue:
480
  
Inhibitor
Name:
BDBM50397793
Synonyms:
CHEMBL2177835
Type:
Small organic molecule
Emp. Form.:
C31H24N6O
Mol. Mass.:
496.5619
SMILES:
Nc1ncccc1-c1nc2ccc(nc2n1-c1ccc(CNC(=O)c2ccccc2)cc1)-c1ccccc1
: