Target
Muscarinic acetylcholine receptor M2
Ligand
BDBM50413110
Substrate
Meas. Tech.
ChEMBL_496880 (CHEMBL998549)
Kd
0.2±n/a nM
Citation
 Jin, JWang, YShi, DWang, FFu, WDavis, RSJin, QFoley, JJSarau, HMMorrow, DMMoore, MLRivero, RAPalovich, MSalmon, MBelmonte, KEBusch-Petersen, J Muscarinic acetylcholine receptor antagonists: SAR and optimization of tyrosine ureas. Bioorg Med Chem Lett 18:5481-6 (2008)  
Target
Name:
Muscarinic acetylcholine receptor M2
Synonyms:
ACM2_HUMAN Cholinergic, muscarinic M2 Muscarinic acetylcholine receptor M2 and M5 | RecName: Full=Muscarinic acetylcholine receptor M2
Type:
GPCR
Mol. Mass.:
51730.61
Organism:
Homo sapiens (Human)
Description:
P08172
Residue:
466
  
Inhibitor
Name:
BDBM50413110
Synonyms:
CHEMBL540148
Type:
Small organic molecule
Emp. Form.:
C31H39N4O6S
Mol. Mass.:
595.729
SMILES:
CC(C)OC(=O)c1ccc(NC(=O)N[C@@H](Cc2ccc(O)cc2)C(=O)N[C@H]2CCC[N+](C)(Cc3ccc(O)cc3)C2)s1
: