Target
Muscarinic acetylcholine receptor M1
Ligand
BDBM50413110
Substrate
Meas. Tech.
ChEMBL_496879 (CHEMBL998548)
Kd
31.62±n/a nM
Citation
 Jin, JWang, YShi, DWang, FFu, WDavis, RSJin, QFoley, JJSarau, HMMorrow, DMMoore, MLRivero, RAPalovich, MSalmon, MBelmonte, KEBusch-Petersen, J Muscarinic acetylcholine receptor antagonists: SAR and optimization of tyrosine ureas. Bioorg Med Chem Lett 18:5481-6 (2008)  
Target
Name:
Muscarinic acetylcholine receptor M1
Synonyms:
ACM1_HUMAN Cholinergic receptor, muscarinic 1 | Cholinergic, muscarinic M1
Type:
Protein
Mol. Mass.:
51442.54
Organism:
Homo sapiens (Human)
Description:
P11229
Residue:
460
  
Inhibitor
Name:
BDBM50413110
Synonyms:
CHEMBL540148
Type:
Small organic molecule
Emp. Form.:
C31H39N4O6S
Mol. Mass.:
595.729
SMILES:
CC(C)OC(=O)c1ccc(NC(=O)N[C@@H](Cc2ccc(O)cc2)C(=O)N[C@H]2CCC[N+](C)(Cc3ccc(O)cc3)C2)s1
: