Target
Muscarinic acetylcholine receptor M3
Ligand
BDBM50413414
Substrate
Meas. Tech.
ChEMBL_562387 (CHEMBL1018820)
IC50
79.43±n/a nM
Citation
 Budzik, BWang, YShi, DWang, FXie, HWan, ZZhu, CFoley, JJNuthulaganti, PKallal, LASarau, HMMorrow, DMMoore, MLRivero, RAPalovich, MSalmon, MBelmonte, KELaine, DIJin, J M3 muscarinic acetylcholine receptor antagonists: SAR and optimization of bi-aryl amines. Bioorg Med Chem Lett 19:1686-90 (2009)  
Target
Name:
Muscarinic acetylcholine receptor M3
Synonyms:
ACM3_HUMAN Cholinergic, muscarinic M3 Muscarinic receptor M3 | RecName: Full=Muscarinic acetylcholine receptor M3
Type:
Enzyme
Mol. Mass.:
66151.03
Organism:
Homo sapiens (Human)
Description:
P20309
Residue:
590
  
Inhibitor
Name:
BDBM50413414
Synonyms:
CHEMBL492988
Type:
Small organic molecule
Emp. Form.:
C27H27N3O3
Mol. Mass.:
441.5216
SMILES:
O=C(NCc1cccc(c1)-c1cccc(CN2C[C@@H]3C[C@H]2CN3)c1)c1ccc2OCOc2c1
: