Target
P2X purinoceptor 7
Ligand
BDBM50414314
Substrate
Meas. Tech.
ChEMBL_574385 (CHEMBL1028693)
IC50
0.316±n/a nM
Citation
 Guile, SDAlcaraz, LBirkinshaw, TNBowers, KCEbden, MRFurber, MStocks, MJ Antagonists of the P2X(7) receptor. From lead identification to drug development. J Med Chem 52:3123-41 (2009)  
Target
Name:
P2X purinoceptor 7
Synonyms:
ATP receptor P2RX7_HUMAN P2X purinoceptor 7 (P2X7) P2Z receptor | Purinergic receptor
Type:
Protein
Mol. Mass.:
68602.85
Organism:
Homo sapiens (Human)
Description:
Q99572
Residue:
595
  
Inhibitor
Name:
BDBM50414314
Synonyms:
CHEMBL564882
Type:
Small organic molecule
Emp. Form.:
C21H15ClF4N2O2
Mol. Mass.:
438.803
SMILES:
Fc1c(CC(=O)Nc2c(Cl)ccc3c2ccn(C2CC2)c3=O)cccc1C(F)(F)F
: