Target
Muscarinic acetylcholine receptor M4
Ligand
BDBM50420104
Substrate
Meas. Tech.
ChEMBL_830306 (CHEMBL2060895)
EC50
1348.96±n/a nM
Citation
 Salovich, JMVinson, PNSheffler, DJLamsal, AUtley, TJBlobaum, ALBridges, TMLe, UJones, CKWood, MRDaniels, JSConn, PJNiswender, CMLindsley, CWHopkins, CR Discovery of N-(4-methoxy-7-methylbenzo[d]thiazol-2-yl)isonicatinamide, ML293, as a novel, selective and brain penetrant positive allosteric modulator of the muscarinic 4 (M4) receptor. Bioorg Med Chem Lett 22:5084-8 (2012)  
Target
Name:
Muscarinic acetylcholine receptor M4
Synonyms:
ACM4_HUMAN Cholinergic, muscarinic M4 Muscarinic acetylcholine receptor M2 and M4
Type:
Enzyme Catalytic Domain
Mol. Mass.:
53079.31
Organism:
Homo sapiens (Human)
Description:
Cholinergic, muscarinic M4 CHRM4 HUMAN M3::P08173
Residue:
479
  
Inhibitor
Name:
BDBM50420104
Synonyms:
CHEMBL2057376
Type:
Small organic molecule
Emp. Form.:
C14H12N2O3S
Mol. Mass.:
288.322
SMILES:
COc1ccc(C)c2sc(NC(=O)c3ccco3)nc12
: