Target
Melanin-concentrating hormone receptor 1
Ligand
BDBM50422924
Substrate
Meas. Tech.
ChEMBL_397361 (CHEMBL908026)
IC50
2.5±n/a nM
Citation
 Hertzog, DLAl-Barazanji, KABigham, ECBishop, MJBritt, CSCarlton, DLCooper, JPDaniels, AJGarrido, DMGoetz, ASGrizzle, MKGuo, YCHandlon, ALIgnar, DMMorgan, ROPeat, AJTavares, FXZhou, H The discovery and optimization of pyrimidinone-containing MCH R1 antagonists. Bioorg Med Chem Lett 16:4723-7 (2006)  
Target
Name:
Melanin-concentrating hormone receptor 1
Synonyms:
G-protein coupled receptor 24 MCH receptor 1 MCH-R1 MCHR-1 MCHR1_HUMAN Melanin-Concentrating Hormone Receptor 1 (MCH1R) Melanin-concentrating hormone receptor 1 (MCH-1) Melanin-concentrating hormone receptor 1 (MCHR-1) SLC-1 Somatostatin receptor-like protein
Type:
G Protein-Coupled Receptor (GPCR)
Mol. Mass.:
45976.27
Organism:
Homo sapiens (Human)
Description:
Membranes from CHO-K1 cells stably expressing human MCH1R were used in assays.
Residue:
422
  
Inhibitor
Name:
BDBM50422924
Synonyms:
CHEMBL214416
Type:
Small organic molecule
Emp. Form.:
C26H24F3N3O3S
Mol. Mass.:
515.547
SMILES:
COc1cc(ccc1OCCN1CCCC1)-n1cnc2cc(sc2c1=O)-c1ccc(cc1)C(F)(F)F
: