Target
Ephrin type-A receptor 2
Ligand
BDBM50425864
Substrate
Meas. Tech.
ChEMBL_933958 (CHEMBL2317776)
IC50
30000±n/a nM
Citation
 Powell, NAHoffman, JKCiske, FLKohrt, JTBaxi, SMPeng, YWZhong, MCatana, COhren, JPerrin, LAEdmunds, JJ Optimization of highly selective 2,4-diaminopyrimidine-5-carboxamide inhibitors of Sky kinase. Bioorg Med Chem Lett 23:1051-5 (2013)  
Target
Name:
Ephrin type-A receptor 2
Synonyms:
ECK EPHA2_HUMAN Epithelial cell kinase | Tyrosine-protein kinase receptor ECK
Type:
PROTEIN
Mol. Mass.:
108260.70
Organism:
Homo sapiens (Human)
Description:
ChEMBL_1505248
Residue:
976
  
Inhibitor
Name:
BDBM50425864
Synonyms:
CHEMBL2312649
Type:
Small organic molecule
Emp. Form.:
C25H35Cl2N7O
Mol. Mass.:
520.498
SMILES:
CN(C)C1CCC(CC1)Nc1nc(Nc2cc(Cl)cc(Cl)c2)ncc1C(=O)NC1CCN(C)CC1
: