Target
Calcium/calmodulin-dependent protein kinase type 1
Ligand
BDBM50425864
Substrate
Meas. Tech.
ChEMBL_933966 (CHEMBL2317784)
IC50
19660±n/a nM
Citation
 Powell, NAHoffman, JKCiske, FLKohrt, JTBaxi, SMPeng, YWZhong, MCatana, COhren, JPerrin, LAEdmunds, JJ Optimization of highly selective 2,4-diaminopyrimidine-5-carboxamide inhibitors of Sky kinase. Bioorg Med Chem Lett 23:1051-5 (2013)  
Target
Name:
Calcium/calmodulin-dependent protein kinase type 1
Synonyms:
CAMK1 CaM kinase I alpha CaMKI-alpha KCC1A_HUMAN
Type:
PROTEIN
Mol. Mass.:
41325.04
Organism:
Homo sapiens (Human)
Description:
ChEMBL_655701
Residue:
370
  
Inhibitor
Name:
BDBM50425864
Synonyms:
CHEMBL2312649
Type:
Small organic molecule
Emp. Form.:
C25H35Cl2N7O
Mol. Mass.:
520.498
SMILES:
CN(C)C1CCC(CC1)Nc1nc(Nc2cc(Cl)cc(Cl)c2)ncc1C(=O)NC1CCN(C)CC1
: