Target
Vitamin D3 receptor
Ligand
BDBM50426941
Substrate
Meas. Tech.
ChEMBL_938940 (CHEMBL2328429)
IC50
24000±n/a nM
Citation
 Mita, YDodo, KNoguchi-Yachide, THashimoto, YIshikawa, M Structure-activity relationship of benzodiazepine derivatives as LXXLL peptide mimetics that inhibit the interaction of vitamin D receptor with coactivators. Bioorg Med Chem 21:993-1005 (2013)  
Target
Name:
Vitamin D3 receptor
Synonyms:
1,25-dihydroxyvitamin D3 receptor Nuclear receptor subfamily 1 group I member 1 VDR | VDR_HUMAN
Type:
Protein
Mol. Mass.:
48288.72
Organism:
Homo sapiens (Human)
Description:
P11473
Residue:
427
  
Inhibitor
Name:
BDBM50426941
Synonyms:
CHEMBL2325057
Type:
Small organic molecule
Emp. Form.:
C24H33N3O
Mol. Mass.:
379.5383
SMILES:
CC(C)CCN1Cc2cc(c(N)cc2N[C@@H](CC(C)C)C1=O)-c1ccccc1
: