Target
Vitamin D3 receptor
Ligand
BDBM50426947
Substrate
Meas. Tech.
ChEMBL_938940 (CHEMBL2328429)
IC50
>30000±n/a nM
Citation
 Mita, YDodo, KNoguchi-Yachide, THashimoto, YIshikawa, M Structure-activity relationship of benzodiazepine derivatives as LXXLL peptide mimetics that inhibit the interaction of vitamin D receptor with coactivators. Bioorg Med Chem 21:993-1005 (2013)  
Target
Name:
Vitamin D3 receptor
Synonyms:
1,25-dihydroxyvitamin D3 receptor Nuclear receptor subfamily 1 group I member 1 VDR | VDR_HUMAN
Type:
Protein
Mol. Mass.:
48288.72
Organism:
Homo sapiens (Human)
Description:
P11473
Residue:
427
  
Inhibitor
Name:
BDBM50426947
Synonyms:
CHEMBL2325049
Type:
Small organic molecule
Emp. Form.:
C21H34N2O2
Mol. Mass.:
346.5069
SMILES:
CC(C)CCN1Cc2cc(CCCO)ccc2N[C@@H](CC(C)C)C1=O
: