Target
Amine oxidase [flavin-containing] A
Ligand
BDBM50427726
Substrate
Meas. Tech.
ChEMBL_941905 (CHEMBL2329971)
IC50
11±n/a nM
Citation
 Pisani, LBarletta, MSoto-Otero, RNicolotti, OMendez-Alvarez, ECatto, MIntrocaso, AStefanachi, ACellamare, SAltomare, CCarotti, A Discovery, biological evaluation, and structure-activity and -selectivity relationships of 6'-substituted (E)-2-(benzofuran-3(2H)-ylidene)-N-methylacetamides, a novel class of potent and selective monoamine oxidase inhibitors. J Med Chem 56:2651-64 (2013)  
Target
Name:
Amine oxidase [flavin-containing] A
Synonyms:
AOFA_RAT Amine oxidase [flavin-containing] A Monoamine Oxidase Type A (MAO-A) Monoamine oxidase A (MAO-A) Monoamine oxidase type A (MAOA)
Type:
Enzyme
Mol. Mass.:
59515.21
Organism:
Rattus norvegicus (rat)
Description:
Residue:
526
  
Inhibitor
Name:
BDBM50427726
Synonyms:
CHEMBL2324221
Type:
Small organic molecule
Emp. Form.:
C18H17NO6S
Mol. Mass.:
375.396
SMILES:
CNC(=O)\C=C1\COc2cc(OS(=O)(=O)c3ccc(OC)cc3)ccc12
: