Target
G-protein coupled bile acid receptor 1
Ligand
BDBM50429123
Substrate
Meas. Tech.
ChEMBL_943575 (CHEMBL2343388)
EC50
7.9±n/a nM
Citation
 Londregan, ATPiotrowski, DWFutatsugi, KWarmus, JSBoehm, MCarpino, PAChin, JEJanssen, AMRoush, NSBuxton, JHinchey, T Discovery of 5-phenoxy-1,3-dimethyl-1H-pyrazole-4-carboxamides as potent agonists of TGR5 via sequential combinatorial libraries. Bioorg Med Chem Lett 23:1407-11 (2013)  
Target
Name:
G-protein coupled bile acid receptor 1
Synonyms:
BG37 GPBAR_HUMAN TGR5 hGPCR19
Type:
G Protein-Coupled Receptor (GPCR)
Mol. Mass.:
35260.02
Organism:
Homo sapiens (Human)
Description:
CHO cells transiently transfected with hTGR5.
Residue:
330
  
Inhibitor
Name:
BDBM50429123
Synonyms:
CHEMBL2336236
Type:
Small organic molecule
Emp. Form.:
C21H20Cl2N4O2
Mol. Mass.:
431.315
SMILES:
Cc1nn(C)c(Oc2cccc(Cl)c2Cl)c1C(=O)N(Cc1cccnc1)C1CC1
: