Target
Atypical chemokine receptor 3
Ligand
BDBM50434047
Substrate
Meas. Tech.
ChEMBL_958224 (CHEMBL2384567)
IC50
10000±n/a nM
Citation
 Yoshikawa, YOishi, SKubo, TTanahara, NFujii, NFuruya, T Optimized method of G-protein-coupled receptor homology modeling: its application to the discovery of novel CXCR7 ligands. J Med Chem 56:4236-51 (2013)  
Target
Name:
Atypical chemokine receptor 3
Synonyms:
ACKR3 C-X-C chemokine receptor type 7 CMKOR1 CXCR-7 Chemokine orphan receptor 1 G-protein coupled receptor RDC1 homolog RDC-1 | RDC1
Type:
Enzyme
Mol. Mass.:
41498.84
Organism:
Homo sapiens (Human)
Description:
P25106
Residue:
362
  
Inhibitor
Name:
BDBM50434047
Synonyms:
CHEMBL1407777
Type:
Small organic molecule
Emp. Form.:
C22H24N4OS
Mol. Mass.:
392.517
SMILES:
CCN1CCc2nc3sc(C(=O)N4CCc5ccccc5C4)c(N)c3cc2C1
: