Target
Methionine aminopeptidase 2
Ligand
BDBM50437324
Substrate
Meas. Tech.
ChEMBL_972463 (CHEMBL2412833)
IC50
9.0±n/a nM
Citation
 Wangtrakuldee, PByrd, MSCampos, CGHenderson, MWZhang, ZClare, MMasoudi, AMyler, PJHorn, JRCotter, PAHagen, TJ Discovery of Inhibitors of ACS Med Chem Lett 4:699-703 (2013)  
Target
Name:
Methionine aminopeptidase 2
Synonyms:
Initiation factor 2-associated 67 kDa glycoprotein MAP2_HUMAN MNPEP Methionine aminopeptidase 2 (MetAP2) P67EIF2 p67
Type:
Enzyme
Mol. Mass.:
52884.45
Organism:
Homo sapiens (Human)
Description:
P50579
Residue:
478
  
Inhibitor
Name:
BDBM50437324
Synonyms:
CHEMBL2407597
Type:
Small organic molecule
Emp. Form.:
C14H12BrNO4S
Mol. Mass.:
370.218
SMILES:
Cc1ccc(cc1)S(=O)(=O)Nc1ccc(Br)cc1C(O)=O
: