Target
Signal transducer and activator of transcription 3
Ligand
BDBM50440941
Substrate
Meas. Tech.
ChEMBL_985292 (CHEMBL2434703)
IC50
22800±n/a nM
Citation
 Page, BDCroucher, DCLi, ZHHaftchenary, SJimenez-Zepeda, VHAtkinson, JSpagnuolo, PAWong, YLColaguori, RLewis, AMSchimmer, ADTrudel, SGunning, PT Inhibiting aberrant signal transducer and activator of transcription protein activation with tetrapodal, small molecule Src homology 2 domain binders: promising agents against multiple myeloma. J Med Chem 56:7190-200 (2013)  
Target
Name:
Signal transducer and activator of transcription 3
Synonyms:
APRF STAT3_HUMAN Signal transducer and activator of transcription 3 (STAT3)
Type:
Protein
Mol. Mass.:
88064.31
Organism:
Homo sapiens (Human)
Description:
P40763
Residue:
770
  
Inhibitor
Name:
BDBM50440941
Synonyms:
CHEMBL2431940 | US10196373, Compound BP2-121
Type:
Small organic molecule
Emp. Form.:
C36H34F4N2O6S
Mol. Mass.:
698.724
SMILES:
Cc1ccc(cc1)S(=O)(=O)N(CC(=O)N(Cc1ccc(cc1)C1CCCCC1)c1ccc(C(O)=O)c(O)c1)Cc1c(F)c(F)cc(F)c1F
: