Target
Macrophage colony-stimulating factor 1 receptor
Ligand
BDBM50443154
Substrate
Meas. Tech.
ChEMBL_1276354 (CHEMBL3088372)
IC50
13±n/a nM
Citation
 Illig, CRManthey, CLMeegalla, SKWall, MJChen, JWilson, KJDesJarlais, RLBallentine, SKSchubert, CCrysler, CSChen, YMolloy, CJChaikin, MADonatelli, RRYurkow, EZhou, ZPlayer, MRTomczuk, BE Enhancement of kinase selectivity in a potent class of arylamide FMS inhibitors. Bioorg Med Chem Lett 23:6363-9 (2013)  
Target
Name:
Macrophage colony-stimulating factor 1 receptor
Synonyms:
CSF1R_MOUSE Csfmr Macrophage colony-stimulating factor 1 receptor Proto-oncogene c-Fms
Type:
Protein
Mol. Mass.:
109173.45
Organism:
Mus musculus (Mouse)
Description:
P09581
Residue:
977
  
Inhibitor
Name:
BDBM50443154
Synonyms:
CHEMBL3085973 | US8674100, 147
Type:
Small organic molecule
Emp. Form.:
C26H35N5O2
Mol. Mass.:
449.5884
SMILES:
COCCNCC(C)(C)c1ccc(NC(=O)c2ncc([nH]2)C#N)c(c1)C1=CCC(C)(C)CC1
: