Target
Neurotensin receptor type 1
Ligand
BDBM50443382
Substrate
Meas. Tech.
ChEMBL_1276096 (CHEMBL3089088)
Ki
0.980000±n/a nM
Citation
 Lang, CMaschauer, SHübner, HGmeiner, PPrante, O Synthesis and evaluation of a (18)F-labeled diarylpyrazole glycoconjugate for the imaging of NTS1-positive tumors. J Med Chem 56:9361-5 (2013)  
Target
Name:
Neurotensin receptor type 1
Synonyms:
Dopamine receptor D2L/neurotensin receptor NTS1 NTRR Neurotensin receptor 1 | neurotensin receptor type 1
Type:
PROTEIN
Mol. Mass.:
46278.89
Organism:
Homo sapiens (Human)
Description:
ChEMBL_1453811
Residue:
418
  
Inhibitor
Name:
BDBM50443382
Synonyms:
CHEMBL3086356
Type:
Small organic molecule
Emp. Form.:
C50H67FN8O10
Mol. Mass.:
959.113
SMILES:
COc1cccc(OC)c1-c1cc(nn1-c1ccc(cc1C(C)C)C(=O)N(C)CCCN(C)CCCCc1cn(nn1)[C@@H]1O[C@H](CO)[C@@H](O)[C@H](O)[C@H]1F)C(=O)NC1(C2CC3CC(C2)CC1C3)C(O)=O
: